React-native 0.60 Error

안녕하세요.

React Native 를 0.60 으로 Update 하고 난후에도 잘되던 Project 가
갑자기 몇일전부터 아래처럼 react-native-reanimated 를 못찾는 것 같은 Error 가 나고 있습니다.
혹시 이런 현상 있으셨던 분 있으시면 정보 부탁드립니다.

Deprecated Gradle features were used in this build, making it incompatible with Gradle 6.0.
Use ‘–warning-mode all’ to show the individual deprecation warnings.
See …
12 actionable tasks: 1 executed, 11 up-to-date
C:\Users\zmfhdn\Desktop\ReactNative\StudyLab\android\app\src\main\java\com\studylab\MainApplication.java:10: error: package com.swmansion.gesturehandler.react does not exist
import com.swmansion.gesturehandler.react.RNGestureHandlerPackage;
^
C:\Users\zmfhdn\Desktop\ReactNative\StudyLab\android\app\src\main\java\com\studylab\MainApplication.java:26: error: cannot find symbol
new ReanimatedPackage(),
^
symbol: class ReanimatedPackage
C:\Users\zmfhdn\Desktop\ReactNative\StudyLab\android\app\src\main\java\com\studylab\MainApplication.java:28: error: cannot find symbol
new RNGestureHandlerPackage()
^
symbol: class RNGestureHandlerPackage
3 errors

FAILURE: Build failed with an exception.

  • What went wrong:
    Execution failed for task ‘:app:compileDebugJavaWithJavac’.
    > Compilation failed; see the compiler error output for details.

  • Try:
    Run with --stacktrace option to get the stack trace. Run with --info or --debug option to get more log output. Run with --scan to get full insights.

BUILD FAILED in 2m 58s

error Failed to install the app. Make sure you have the Android development environment set up: … Run CLI with --verbose flag for more details.
Error: Command failed: gradlew.bat app:installDebug -PreactNativeDevServerPort=8081
C:\Users\zmfhdn\Desktop\ReactNative\StudyLab\android\app\src\main\java\com\studylab\MainApplication.java:10: error: package com.swmansion.gesturehandler.react does not exist
import com.swmansion.gesturehandler.react.RNGestureHandlerPackage;
^
C:\Users\zmfhdn\Desktop\ReactNative\StudyLab\android\app\src\main\java\com\studylab\MainApplication.java:26: error: cannot find symbol
new ReanimatedPackage(),
^
symbol: class ReanimatedPackage
C:\Users\zmfhdn\Desktop\ReactNative\StudyLab\android\app\src\main\java\com\studylab\MainApplication.java:28: error: cannot find symbol
new RNGestureHandlerPackage()
^
symbol: class RNGestureHandlerPackage
3 errors

FAILURE: Build failed with an exception.

  • What went wrong:
    Execution failed for task ‘:app:compileDebugJavaWithJavac’.
    > Compilation failed; see the compiler error output for details.

  • Try:
    Run with --stacktrace option to get the stack trace. Run with --info or --debug option to get more log output. Run with --scan to get full insights.

BUILD FAILED in 2m 58s

at checkExecSyncError (child_process.js:637:11)
at execFileSync (child_process.js:655:13)
at runOnAllDevices (C:\Users\zmfhdn\Desktop\ReactNative\StudyLab\node_modules\@react-native-community\cli-platform-android\build\commands\runAndroid\runOnAllDevices.js:74:39)
at buildAndRun (C:\Users\zmfhdn\Desktop\ReactNative\StudyLab\node_modules\@react-native-community\cli-platform-android\build\commands\runAndroid\index.js:158:41)
at then.result (C:\Users\zmfhdn\Desktop\ReactNative\StudyLab\node_modules\@react-native-community\cli-platform-android\build\commands\runAndroid\index.js:125:12)
at processTicksAndRejections (internal/process/next_tick.js:81:5)

react-native-reanimated 라이브러리가 현재 androidx를 지원하고 있지 않은 것 같네요.

react navigation 이 버전이 6.0 이 되면서 바뀌었습니다. https://reactnavigation.org/docs/en/getting-started.html 로가면… 안드로이드에서 셑업해야 되는게 나옵니다. 제스처 핸들러라는게 안드로이드 스튜디오에 보여야 합니다.

이 가이드대로 해봐야겠네요~~ 답변 감사합니다